{"text_format":"1","workbook":"xlsx","n_sheets":12,"sheets":["Prezenční listina","Startovní listina","Výsledková listina","Družstva","Běh Vírem","mezičasy","mezičasy 2015","Diplom MSM A5","Diplom MSM A5 (2)","Výsledková listina 2015","Družstva (prac.)","Výsledková listina (2)"],"not_rendered":{"charts":0,"images":19,"macros":1,"external_links":2,"defined_names":15,"comments":0,"pivot_tables":0},"unopened":[],"bounds":{"document_bytes":16777216,"sheet_cells":100000,"rows_first":2000,"rows_last":500,"rows_between":2000,"halvings":0,"cell_chars":16384,"cell_head_chars":4096},"cells_cut":0,"cells_raw":0,"read":"whole","date_system":"1900"}

{"sheet":"Prezenční listina","index":0,"n_rows":152,"n_cols":19,"rows_kept":152,"cut":false,"hidden":true,"merged":[[5,10,5,12],[0,0,0,7]]}
[{"$f":"\"Prezenční listina - Malý svratecký maratón \"&O2","v":"Prezenční listina - Malý svratecký maratón 2016"}]
[null,"Příjmení","Jméno","Narození","Oddíl / Bydliště","Startovní číslo","Adresa (e-mail)","Kategorie",null,null,null,null,null,null,2016,null,null,null,"Pohlaví"]
[1,"Alman","Dušan",1967,"Babice nad Svitavou",42,"Babice n S",{"$f":"IF(S3<>\"Ž\",IF($O$2-D3>39,IF($O$2-D3>49,IF($O$2-D3>59,IF($O$2-D3>69,IF($O$2-D3>90,\"\",\"E\"),\"D\"),\"C\"),\"B\"),\"A\"),IF(S3=\"Ž\",IF($O$2-D3>34,IF($O$2-D3>44,IF($O$2-D3>90,\"\",\"H\"),\"G\"),\"F\")))","v":"B"},null,null,null,null,null,null,null,null,null,null,{"$f":"IF(LEN(B3)=0,\" \",IF(MID(B3,LEN(B3),1)=\"á\",\"Ž\",\"M\"))","v":"M"}]
[{"$f":"IF(B4<>0,A3+1,\"\")","v":2},"Barták","Ronald",1965,"Kuřim",41,"Kuřim","C",null,null,null,null,null,null,null,null,null,null,"M"]
[3,"Barvíř","Jiří",1982,"R.I.P. Brno",2,"Ježkova 7, Brno","A",null,null,null,null,null,null,null,null,null,null,"M"]
[4,"Brabenec","Miroslav",1959,"Žďár nad Sázavou",67,"Žďár nad Sáz.","C",null,null,"Rok nastavit v buňce O2",null,null,null,null,null,null,null,"M"]
[5,"Brabenec","Aleš",1987,"Žďár nad Sázavou",69,"Žďár nad Sáz.","A",null,null,null,null,null,null,null,null,null,null,"M"]
[6,"Češner","Vladimír",1958,"Odolená Voda",3,"Odolená Voda","C",null,null,null,null,null,null,null,null,null,null,"M"]
{"$rows_left_out":145}
{"sheet":"Startovní listina","index":1,"n_rows":141,"n_cols":12,"rows_kept":141,"cut":false,"hidden":false,"merged":[[4,11,11,11],[0,0,0,6],[2,0,2,6],[1,0,1,6],[1,8,2,9]]}
[{"$f":"\"Startovní listina - Malý svratecký maraton \"&'Prezenční listina'!O2","v":"Startovní listina - Malý svratecký maraton 2016"}]
["2016-08-20",null,null,null,null,null,null,null,"Počet přihlášených v jednotlivých kategoriích"]
[{"$f":"'Prezenční listina'!O2-1953&\". ročník\"","v":"63. ročník"},null,null,null,null,null,null,null,null,null,null,"Celkem startujících"]
[null,"Startovní číslo","Příjmení","Jméno","Narození","Oddíl / Bydliště","Kategorie"]
[1,{"$f":"IF('Prezenční listina'!F28=0,\"\",'Prezenční listina'!F28)","v":1},{"$f":"IF('Prezenční listina'!F28=0,\"\",'Prezenční listina'!B28)","v":"Kratochvíl"},{"$f":"IF('Prezenční listina'!F28=0,\"\",'Prezenční listina'!C28)","v":"Jaroslav"},{"$f":"IF('Prezenční listina'!F28=0,\"\",'Prezenční listina'!D28)","v":1977},{"$f":"IF('Prezenční listina'!F28=0,\"\",'Prezenční listina'!E28)","v":"SDH Hluboké"},{"$f":"IF('Prezenční listina'!F28=0,\"\",'Prezenční listina'!H28)","v":"A"},null,"A:",{"$f":"COUNTIF($G$5:$G$141,\"A\")","v":23},null,{"$f":"COUNT(B5:B141)","v":80}]
[{"$f":"IF(C6=\"\",\"\",A5+1)","v":2},{"$f":"IF('Prezenční listina'!F5=0,\"\",'Prezenční listina'!F5)","v":2},{"$f":"IF('Prezenční listina'!F5=0,\"\",'Prezenční listina'!B5)","v":"Barvíř"},{"$f":"IF('Prezenční listina'!F5=0,\"\",'Prezenční listina'!C5)","v":"Jiří"},{"$f":"IF('Prezenční listina'!F5=0,\"\",'Prezenční listina'!D5)","v":1982},{"$f":"IF('Prezenční listina'!F5=0,\"\",'Prezenční listina'!E5)","v":"R.I.P. Brno"},{"$f":"IF('Prezenční listina'!F5=0,\"\",'Prezenční listina'!H5)","v":"A"},null,"B:",{"$f":"COUNTIF($G$5:$G$141,\"B\")","v":19}]
[3,{"$f":"IF('Prezenční listina'!F8=0,\"\",'Prezenční listina'!F8)","v":3},{"$f":"IF('Prezenční listina'!F8=0,\"\",'Prezenční listina'!B8)","v":"Češner"},{"$f":"IF('Prezenční listina'!F8=0,\"\",'Prezenční listina'!C8)","v":"Vladimír"},{"$f":"IF('Prezenční listina'!F8=0,\"\",'Prezenční listina'!D8)","v":1958},{"$f":"IF('Prezenční listina'!F8=0,\"\",'Prezenční listina'!E8)","v":"Odolená Voda"},{"$f":"IF('Prezenční listina'!F8=0,\"\",'Prezenční listina'!H8)","v":"C"},null,"C:",{"$f":"COUNTIF($G$5:$G$141,\"C\")","v":16}]
[4,{"$f":"IF('Prezenční listina'!F20=0,\"\",'Prezenční listina'!F20)","v":4},{"$f":"IF('Prezenční listina'!F20=0,\"\",'Prezenční listina'!B20)","v":"Komárková"},{"$f":"IF('Prezenční listina'!F20=0,\"\",'Prezenční listina'!C20)","v":"Zdeňka"},{"$f":"IF('Prezenční listina'!F20=0,\"\",'Prezenční listina'!D20)","v":1974},{"$f":"IF('Prezenční listina'!F20=0,\"\",'Prezenční listina'!E20)","v":"SDH Bolešín"},{"$f":"IF('Prezenční listina'!F20=0,\"\",'Prezenční listina'!H20)","v":"G"},null,"D:",{"$f":"COUNTIF($G$5:$G$141,\"D\")","v":9}]
{"$rows_left_out":134}
{"sheet":"Výsledková listina","index":2,"n_rows":104,"n_cols":11,"rows_kept":104,"cut":false,"hidden":false,"merged":[[0,0,0,8],[2,0,2,8],[1,0,1,8],[1,10,12,14]]}
[{"$f":"\"Výsledková listina - Malý svratecký maraton \"&'Prezenční listina'!O2","v":"Výsledková listina - Malý svratecký maraton 2016"}]
["2016-08-20",null,null,null,null,null,null,null,null,null,"\nPoté, co jsou dopsány časy VŠECH běžců, stisknout tlačítko 1.řazení \n\n\nVe sloupci B (Pořadí v kategorii) vytvořit posloupnou číselnou řadu pro každou kategorii a poté stisknout tlačítko 2.řazení\n\n\n                      !!! POZOR!!!\n\n               Použití tlačítek je nevratný krok!"]
[{"$f":"'Prezenční listina'!O2-1953&\". ročník\"","v":"63. ročník"}]
["Celkové pořadí","Pořadí v kategorii","Kategorie","Startovní číslo","Příjmení","Jméno","Narození","Oddíl / Bydliště","Čas"]
[1,1,{"$f":"'Startovní listina'!G30","v":"A"},{"$f":"'Startovní listina'!B30","v":31},{"$f":"'Startovní listina'!C30","v":"Kohut"},{"$f":"'Startovní listina'!D30","v":"Jan"},{"$f":"'Startovní listina'!E30","v":1985},{"$f":"'Startovní listina'!F30","v":"Elite Sport Team Blansko"},"01:57:10"]
[{"$f":"IF('Výsledková listina'!D5<>\"\",A5+1,\"\")","v":2},1,{"$f":"'Startovní listina'!G67","v":"B"},{"$f":"'Startovní listina'!B67","v":83},{"$f":"'Startovní listina'!C67","v":"Orálek"},{"$f":"'Startovní listina'!D67","v":"Daniel"},{"$f":"'Startovní listina'!E67","v":1970},{"$f":"'Startovní listina'!F67","v":"adidas Boost Team/AC Moravská Slávia Brno"},"01:58:15"]
[{"$f":"IF('Výsledková listina'!D6<>\"\",A6+1,\"\")","v":3},2,{"$f":"'Startovní listina'!G35","v":"A"},{"$f":"'Startovní listina'!B35","v":37},{"$f":"'Startovní listina'!C35","v":"Hrdina"},{"$f":"'Startovní listina'!D35","v":"Tomáš"},{"$f":"'Startovní listina'!E35","v":1979},{"$f":"'Startovní listina'!F35","v":"Běžecký klub Brno"},"02:12:33"]
[{"$f":"IF('Výsledková listina'!D7<>\"\",A7+1,\"\")","v":4},1,{"$f":"'Startovní listina'!G63","v":"C"},{"$f":"'Startovní listina'!B63","v":77},{"$f":"'Startovní listina'!C63","v":"Rerych"},{"$f":"'Startovní listina'!D63","v":"Jiří"},{"$f":"'Startovní listina'!E63","v":1962},{"$f":"'Startovní listina'!F63","v":"adidas Boost Team/AC Moravská Slávia Brno"},"02:15:54"]
{"$rows_left_out":97}
{"sheet":"Družstva","index":3,"n_rows":25,"n_cols":11,"rows_kept":25,"cut":false,"hidden":false,"merged":[[17,1,18,1],[17,6,18,6],[17,8,18,8],[19,1,20,1],[19,6,20,6],[19,8,20,8],[11,6,12,6],[5,8,6,8],[7,8,8,8],[9,8,10,8],[15,1,16,1],[15,6,16,6],[15,8,16,8],[3,8,4,8],[11,8,12,8],[0,1,0,8],[1,1,1,8],[13,8,14,8],[3,1,4,1],[11,1,12,1],[5,1,6,1],[7,1,8,1],[9,1,10,1],[5,6,6,6],[13,1,14,1],[3,6,4,6],[13,6,14,6],[7,6,8,6],[9,6,10,6],[21,1,22,1],[21,6,22,6],[21,8,22,8],[23,1,24,1],[23,6,24,6],[23,8,24,8]]}
[null,{"$f":"\"Výsledková listina - Malý svratecký maratón \"&'Prezenční listina'!O2&\" - družstva\"","v":"Výsledková listina - Malý svratecký maratón 2016 - družstva"}]
[null,{"$f":"'Prezenční listina'!O2-1953&\". ročník\"","v":"63. ročník"}]
[null,"Pořadí","Startovní číslo","Příjmení","Jméno","Narození","Oddíl / Bydliště","Čas","Výsledný čas"]
[null,"1.",77,{"$f":"IF(ISERROR(VLOOKUP(C4,'[1]Startovní listina'!$B$5:$F$141,2)),\"\",VLOOKUP(C4,'[1]Startovní listina'!$B$5:$F$141,2))","v":"Rerych"},{"$f":"IF(ISERROR(VLOOKUP(C4,'[1]Startovní listina'!$B$5:$F$141,3)),\"\",VLOOKUP(C4,'[1]Startovní listina'!$B$5:$F$141,3))","v":"Jiří"},{"$f":"IF(ISERROR(VLOOKUP(C4,'[1]Startovní listina'!$B$5:$F$141,4)),\"\",VLOOKUP(C4,'[1]Startovní listina'!$B$5:$F$141,4))","v":1962},{"$f":"IF(K4=K5,K4,\"RŮZNÉ ODDÍLY !!!\")","v":"adidas Boost Team/AC Moravská Slávia Brno"},"02:15:54",{"$f":"IF((H4=0),\"\",H4+H5)","v":"04:14:09"},null,{"$f":"IF(ISERROR(VLOOKUP(C4,'Startovní listina'!$B$5:$F$141,5)),\"\",VLOOKUP(C4,'Startovní listina'!$B$5:$F$141,5))","v":"adidas Boost Team/AC Moravská Slávia Brno"}]
[null,null,83,{"$f":"IF(ISERROR(VLOOKUP(C5,'[1]Startovní listina'!$B$5:$F$141,2)),\"\",VLOOKUP(C5,'[1]Startovní listina'!$B$5:$F$141,2))","v":"Orálek"},{"$f":"IF(ISERROR(VLOOKUP(C5,'[1]Startovní listina'!$B$5:$F$141,3)),\"\",VLOOKUP(C5,'[1]Startovní listina'!$B$5:$F$141,3))","v":"Daniel"},{"$f":"IF(ISERROR(VLOOKUP(C5,'[1]Startovní listina'!$B$5:$F$141,4)),\"\",VLOOKUP(C5,'[1]Startovní listina'!$B$5:$F$141,4))","v":1970},null,"01:58:15",null,null,{"$f":"IF(ISERROR(VLOOKUP(C5,'Startovní listina'!$B$5:$F$141,5)),\"\",VLOOKUP(C5,'Startovní listina'!$B$5:$F$141,5))","v":"adidas Boost Team/AC Moravská Slávia Brno"}]
[null,"2.",64,{"$f":"IF(ISERROR(VLOOKUP(C6,'[1]Startovní listina'!$B$5:$F$141,2)),\"\",VLOOKUP(C6,'[1]Startovní listina'!$B$5:$F$141,2))","v":"Ožana"},{"$f":"IF(ISERROR(VLOOKUP(C6,'[1]Startovní listina'!$B$5:$F$141,3)),\"\",VLOOKUP(C6,'[1]Startovní listina'!$B$5:$F$141,3))","v":"Václav"},{"$f":"IF(ISERROR(VLOOKUP(C6,'[1]Startovní listina'!$B$5:$F$141,4)),\"\",VLOOKUP(C6,'[1]Startovní listina'!$B$5:$F$141,4))","v":1964},{"$f":"IF(K6=K7,K6,\"RŮZNÉ ODDÍLY !!!\")","v":"Atletic Třebíč"},"02:17:14",{"$f":"IF((H6=0),\"\",H6+H7)","v":"04:41:24"},null,{"$f":"IF(ISERROR(VLOOKUP(C6,'Startovní listina'!$B$5:$F$141,5)),\"\",VLOOKUP(C6,'Startovní listina'!$B$5:$F$141,5))","v":"Atletic Třebíč"}]
[null,null,61,{"$f":"IF(ISERROR(VLOOKUP(C7,'[1]Startovní listina'!$B$5:$F$141,2)),\"\",VLOOKUP(C7,'[1]Startovní listina'!$B$5:$F$141,2))","v":"Nováček"},{"$f":"IF(ISERROR(VLOOKUP(C7,'[1]Startovní listina'!$B$5:$F$141,3)),\"\",VLOOKUP(C7,'[1]Startovní listina'!$B$5:$F$141,3))","v":"Tomáš"},{"$f":"IF(ISERROR(VLOOKUP(C7,'[1]Startovní listina'!$B$5:$F$141,4)),\"\",VLOOKUP(C7,'[1]Startovní listina'!$B$5:$F$141,4))","v":1983},null,"02:24:10",null,null,{"$f":"IF(ISERROR(VLOOKUP(C7,'Startovní listina'!$B$5:$F$141,5)),\"\",VLOOKUP(C7,'Startovní listina'!$B$5:$F$141,5))","v":"Atletic Třebíč"}]
[null,"3.",35,{"$f":"IF(ISERROR(VLOOKUP(C8,'[1]Startovní listina'!$B$5:$F$141,2)),\"\",VLOOKUP(C8,'[1]Startovní listina'!$B$5:$F$141,2))","v":"Dušil"},{"$f":"IF(ISERROR(VLOOKUP(C8,'[1]Startovní listina'!$B$5:$F$141,3)),\"\",VLOOKUP(C8,'[1]Startovní listina'!$B$5:$F$141,3))","v":"Jaroslav"},{"$f":"IF(ISERROR(VLOOKUP(C8,'[1]Startovní listina'!$B$5:$F$141,4)),\"\",VLOOKUP(C8,'[1]Startovní listina'!$B$5:$F$141,4))","v":1970},{"$f":"IF(K8=K9,K8,\"RŮZNÉ ODDÍLY !!!\")","v":"Běžecký klub Brno"},"02:36:14",{"$f":"IF((H8=0),\"\",H8+H9)","v":"04:48:47"},null,{"$f":"IF(ISERROR(VLOOKUP(C8,'Startovní listina'!$B$5:$F$141,5)),\"\",VLOOKUP(C8,'Startovní listina'!$B$5:$F$141,5))","v":"Běžecký klub Brno"}]
{"$rows_left_out":18}
{"sheet":"Běh Vírem","index":4,"n_rows":27,"n_cols":12,"rows_kept":27,"cut":false,"hidden":false,"merged":[[0,0,0,7],[2,3,2,4],[1,3,1,4]]}
[{"$f":"\"Běh Vírem \"&'Prezenční listina'!O2","v":"Běh Vírem 2016"}]
[null,null,null,{"$f":"'Startovní listina'!$A$2","v":"2016-08-20"},{"$f":"'Startovní listina'!$A$2","v":"2016-08-20"}]
[null,null,null,{"$f":"'Prezenční listina'!$O$2-1966&\" . ročník\"","v":"50 . ročník"}]
[null,"Příjmení","Jméno","Narození","Oddíl / Bydliště","Startovní číslo","Čas","Pohlaví"]
["1.","Křenková","Kateřina",2001,"Přeštice",93,"00:12:38",{"$f":"IF(LEN(B5)=0,\" \",IF(MID(B5,LEN(B5),1)=\"á\",\"Ž\",\"M\"))","v":"Ž"}]
["2.","Sojková","Natálie",2000,"Kaplice",95,"00:14:28",{"$f":"IF(LEN(B6)=0,\" \",IF(MID(B6,LEN(B6),1)=\"á\",\"Ž\",\"M\"))","v":"Ž"}]
["3.","Soldánová","Jana",1999,"AK Drnovice",91,"00:15:09",{"$f":"IF(LEN(B7)=0,\" \",IF(MID(B7,LEN(B7),1)=\"á\",\"Ž\",\"M\"))","v":"Ž"}]
["4.","Křenková","Karolína",2001,"Přeštice",92,"00:15:49",{"$f":"IF(LEN(B8)=0,\" \",IF(MID(B8,LEN(B8),1)=\"á\",\"Ž\",\"M\"))","v":"Ž"}]
{"$rows_left_out":20}
{"sheet":"mezičasy","index":5,"n_rows":30,"n_cols":8,"rows_kept":30,"cut":false,"hidden":true,"merged":[[0,0,0,1],[0,2,0,3],[0,4,0,5],[0,6,0,7]]}
["5. km",null,"10. km",null,"16. km",null,"25. km"]
["číslo","čas","číslo","čas","číslo","čas","číslo","čas"]
[83,"00:17:02",31,"00:34:16",31,"00:55:10",31,"01:28:37"]
[31,":      :",83,":      :",83,"00:55:24",83,"01:29:24"]
[37,"00:19:08",8,"00:38:36",37,"01:02:56",37,"01:41:23"]
[8,":      :",37,"00:38:38",8,"01:04:06",8,"01:43:04"]
[74,"00:19:14",77,"00:39:12",64,":      :",77,"01:43:22"]
[12,":      :",64,":      :",77,":      :",null,":      :"]
{"$rows_left_out":23}
{"sheet":"mezičasy 2015","index":6,"n_rows":11,"n_cols":8,"rows_kept":11,"cut":false,"hidden":true,"merged":[[0,0,0,1],[0,2,0,3],[0,4,0,5],[0,6,0,7]]}
["5. km",null,"10. km",null,"16. km",null,"25. km"]
["číslo","čas","číslo","čas","číslo","čas","číslo","čas"]
[107,"00:16:50",107,"00:34:03",107,"00:55:14",107,"01:28:54"]
[60,"00:18:11",11,"00:36:39",11,"00:59:32",11,"01:34:32"]
[22,"00:18:11",60,"00:36:39",60,"00:59:30",60,"01:36:34"]
[82,"00:18:11",82,"00:37:05",40,"01:00:10",26,"01:36:52"]
[11,"00:18:11",40,"00:37:12",82,"01:00:15",40,"01:37:13"]
[26,"00:18:11"]
{"$rows_left_out":4}
{"sheet":"Diplom MSM A5","index":7,"n_rows":36,"n_cols":13,"rows_kept":36,"cut":false,"hidden":true,"merged":[[26,3,28,10],[29,6,31,6],[31,3,34,3],[32,12,33,13],[35,6,36,9]]}
[]
[]
[]
[]
[]
[]
[]
[]
{"$rows_left_out":29}
{"sheet":"Diplom MSM A5 (2)","index":8,"n_rows":36,"n_cols":13,"rows_kept":36,"cut":false,"hidden":true,"merged":[[26,3,28,10],[29,6,31,6],[31,3,34,3],[32,12,33,13],[35,6,36,9]]}
[]
[]
[]
[]
[]
[]
[]
[]
{"$rows_left_out":29}
{"sheet":"Výsledková listina 2015","index":9,"n_rows":103,"n_cols":11,"rows_kept":103,"cut":false,"hidden":true,"merged":[[0,0,0,8],[1,0,1,8],[1,10,12,14],[2,0,2,8]]}
[{"$f":"\"Výsledková listina - Malý svratecký maraton \"&'[2]Prezenční listina'!O2","v":"Výsledková listina - Malý svratecký maraton 2015"}]
["2015-08-22",null,null,null,null,null,null,null,null,null,"\nPoté, co jsou dopsány časy VŠECH běžců, stisknout tlačítko 1.řazení \n\n\nVe sloupci B (Pořadí v kategorii) vytvořit posloupnou číselnou řadu pro každou kategorii a poté stisknout tlačítko 2.řazení\n\n\n                      !!! POZOR!!!\n\n               Použití tlačítek je nevratný krok!"]
[{"$f":"'[2]Prezenční listina'!O2-1953&\". ročník\"","v":"62. ročník"}]
["Celkové pořadí","Pořadí v kategorii","Kategorie","Startovní číslo","Příjmení","Jméno","Narození","Oddíl / Bydliště","Čas"]
[1,1,{"$f":"'[2]Startovní listina'!G98","v":"B"},{"$f":"'[2]Startovní listina'!B98","v":107},{"$f":"'[2]Startovní listina'!C98","v":"Orálek"},{"$f":"'[2]Startovní listina'!D98","v":"Daniel"},{"$f":"'[2]Startovní listina'!E98","v":1970},{"$f":"'[2]Startovní listina'!F98","v":"Moravská Slávia Brno"},"01:54:34"]
[{"$f":"IF('Výsledková listina 2015'!D5<>\"\",A5+1,\"\")","v":2},1,{"$f":"'[2]Startovní listina'!G15","v":"A"},{"$f":"'[2]Startovní listina'!B15","v":11},{"$f":"'[2]Startovní listina'!C15","v":"Fousek"},{"$f":"'[2]Startovní listina'!D15","v":"Jan"},{"$f":"'[2]Startovní listina'!E15","v":1991},{"$f":"'[2]Startovní listina'!F15","v":"MK Seitl Ostrava"},"02:01:16"]
[{"$f":"IF('Výsledková listina 2015'!D6<>\"\",A6+1,\"\")","v":3},2,{"$f":"'[2]Startovní listina'!G27","v":"A"},{"$f":"'[2]Startovní listina'!B27","v":26},{"$f":"'[2]Startovní listina'!C27","v":"Nováček"},{"$f":"'[2]Startovní listina'!D27","v":"Tomáš"},{"$f":"'[2]Startovní listina'!E27","v":1983},{"$f":"'[2]Startovní listina'!F27","v":"Atletic Třebíč"},"02:05:07"]
[{"$f":"IF('Výsledková listina 2015'!D7<>\"\",A7+1,\"\")","v":4},2,{"$f":"'[2]Startovní listina'!G12","v":"B"},{"$f":"'[2]Startovní listina'!B12","v":8},{"$f":"'[2]Startovní listina'!C12","v":"Škapa"},{"$f":"'[2]Startovní listina'!D12","v":"Marek"},{"$f":"'[2]Startovní listina'!E12","v":1971},{"$f":"'[2]Startovní listina'!F12","v":"MK Seitl Ostrava"},"02:05:40"]
{"$rows_left_out":96}
{"sheet":"Družstva (prac.)","index":10,"n_rows":21,"n_cols":11,"rows_kept":21,"cut":false,"hidden":true,"merged":[[5,1,6,1],[5,6,6,6],[5,8,6,8],[0,1,0,8],[1,1,1,8],[3,1,4,1],[3,6,4,6],[3,8,4,8],[7,1,8,1],[7,6,8,6],[7,8,8,8],[9,1,10,1],[9,6,10,6],[9,8,10,8],[11,1,12,1],[11,6,12,6],[11,8,12,8],[13,1,14,1],[13,6,14,6],[13,8,14,8],[19,1,20,1],[19,6,20,6],[19,8,20,8],[15,1,16,1],[15,6,16,6],[15,8,16,8],[17,1,18,1],[17,6,18,6],[17,8,18,8]]}
[null,{"$f":"\"Výsledková listina - Malý svratecký maratón \"&'Prezenční listina'!O2&\" - družstva\"","v":"Výsledková listina - Malý svratecký maratón 2016 - družstva"}]
[null,{"$f":"'Prezenční listina'!O2-1953&\". ročník\"","v":"63. ročník"}]
[null,"Pořadí","Startovní číslo","Příjmení","Jméno","Narození","Oddíl / Bydliště","Čas","Výsledný čas"]
[null,"1.",3,{"$f":"IF(ISERROR(VLOOKUP(C4,'Startovní listina'!$B$5:$F$141,2)),\"\",VLOOKUP(C4,'Startovní listina'!$B$5:$F$141,2))","v":"Češner"},{"$f":"IF(ISERROR(VLOOKUP(C4,'Startovní listina'!$B$5:$F$141,3)),\"\",VLOOKUP(C4,'Startovní listina'!$B$5:$F$141,3))","v":"Vladimír"},{"$f":"IF(ISERROR(VLOOKUP(C4,'Startovní listina'!$B$5:$F$141,4)),\"\",VLOOKUP(C4,'Startovní listina'!$B$5:$F$141,4))","v":1958},{"$f":"IF(K4=K5,K4,\"RŮZNÉ ODDÍLY !!!\")","v":"RŮZNÉ ODDÍLY !!!"},"03:07:50",{"$f":"IF((H4=0),\"\",H4+H5)","v":"05:48:15"},null,{"$f":"IF(ISERROR(VLOOKUP(C4,'Startovní listina'!$B$5:$F$141,5)),\"\",VLOOKUP(C4,'Startovní listina'!$B$5:$F$141,5))","v":"Odolená Voda"}]
[null,null,2,{"$f":"IF(ISERROR(VLOOKUP(C5,'Startovní listina'!$B$5:$F$141,2)),\"\",VLOOKUP(C5,'Startovní listina'!$B$5:$F$141,2))","v":"Barvíř"},{"$f":"IF(ISERROR(VLOOKUP(C5,'Startovní listina'!$B$5:$F$141,3)),\"\",VLOOKUP(C5,'Startovní listina'!$B$5:$F$141,3))","v":"Jiří"},{"$f":"IF(ISERROR(VLOOKUP(C5,'Startovní listina'!$B$5:$F$141,4)),\"\",VLOOKUP(C5,'Startovní listina'!$B$5:$F$141,4))","v":1982},null,"02:40:25",null,null,{"$f":"IF(ISERROR(VLOOKUP(C5,'Startovní listina'!$B$5:$F$141,5)),\"\",VLOOKUP(C5,'Startovní listina'!$B$5:$F$141,5))","v":"R.I.P. Brno"}]
[null,"2.",11,{"$f":"IF(ISERROR(VLOOKUP(C6,'Startovní listina'!$B$5:$F$141,2)),\"\",VLOOKUP(C6,'Startovní listina'!$B$5:$F$141,2))","v":"Kopečný"},{"$f":"IF(ISERROR(VLOOKUP(C6,'Startovní listina'!$B$5:$F$141,3)),\"\",VLOOKUP(C6,'Startovní listina'!$B$5:$F$141,3))","v":"Dušan"},{"$f":"IF(ISERROR(VLOOKUP(C6,'Startovní listina'!$B$5:$F$141,4)),\"\",VLOOKUP(C6,'Startovní listina'!$B$5:$F$141,4))","v":1973},{"$f":"IF(K6=K7,K6,\"RŮZNÉ ODDÍLY !!!\")","v":"RŮZNÉ ODDÍLY !!!"},"02:01:16",{"$f":"IF((H6=0),\"\",H6+H7)","v":"04:06:56"},null,{"$f":"IF(ISERROR(VLOOKUP(C6,'Startovní listina'!$B$5:$F$141,5)),\"\",VLOOKUP(C6,'Startovní listina'!$B$5:$F$141,5))","v":"AK Drnovice"}]
[null,null,8,{"$f":"IF(ISERROR(VLOOKUP(C7,'Startovní listina'!$B$5:$F$141,2)),\"\",VLOOKUP(C7,'Startovní listina'!$B$5:$F$141,2))","v":"Chramosta"},{"$f":"IF(ISERROR(VLOOKUP(C7,'Startovní listina'!$B$5:$F$141,3)),\"\",VLOOKUP(C7,'Startovní listina'!$B$5:$F$141,3))","v":"Jaroslav"},{"$f":"IF(ISERROR(VLOOKUP(C7,'Startovní listina'!$B$5:$F$141,4)),\"\",VLOOKUP(C7,'Startovní listina'!$B$5:$F$141,4))","v":1966},null,"02:05:40",null,null,{"$f":"IF(ISERROR(VLOOKUP(C7,'Startovní listina'!$B$5:$F$141,5)),\"\",VLOOKUP(C7,'Startovní listina'!$B$5:$F$141,5))","v":"JABOJA Team Děčín"}]
[null,"3.",9,{"$f":"IF(ISERROR(VLOOKUP(C8,'Startovní listina'!$B$5:$F$141,2)),\"\",VLOOKUP(C8,'Startovní listina'!$B$5:$F$141,2))","v":"Vytisk"},{"$f":"IF(ISERROR(VLOOKUP(C8,'Startovní listina'!$B$5:$F$141,3)),\"\",VLOOKUP(C8,'Startovní listina'!$B$5:$F$141,3))","v":"Alfons"},{"$f":"IF(ISERROR(VLOOKUP(C8,'Startovní listina'!$B$5:$F$141,4)),\"\",VLOOKUP(C8,'Startovní listina'!$B$5:$F$141,4))","v":1949},{"$f":"IF(K8=K9,K8,\"RŮZNÉ ODDÍLY !!!\")","v":"RŮZNÉ ODDÍLY !!!"},"02:40:16",{"$f":"IF((H8=0),\"\",H8+H9)","v":"05:12:53"},null,{"$f":"IF(ISERROR(VLOOKUP(C8,'Startovní listina'!$B$5:$F$141,5)),\"\",VLOOKUP(C8,'Startovní listina'!$B$5:$F$141,5))","v":"MKS Ostrava"}]
{"$rows_left_out":14}
{"sheet":"Výsledková listina (2)","index":11,"n_rows":103,"n_cols":11,"rows_kept":103,"cut":false,"hidden":true,"merged":[[0,0,0,8],[1,0,1,8],[1,10,12,14],[2,0,2,8]]}
[{"$f":"\"Výsledková listina - Malý svratecký maraton \"&'Prezenční listina'!O2","v":"Výsledková listina - Malý svratecký maraton 2016"}]
["2015-08-22",null,null,null,null,null,null,null,null,null,"\nPoté, co jsou dopsány časy VŠECH běžců, stisknout tlačítko 1.řazení \n\n\nVe sloupci B (Pořadí v kategorii) vytvořit posloupnou číselnou řadu pro každou kategorii a poté stisknout tlačítko 2.řazení\n\n\n                      !!! POZOR!!!\n\n               Použití tlačítek je nevratný krok!"]
[{"$f":"'Prezenční listina'!O2-1953&\". ročník\"","v":"63. ročník"}]
["Celkové pořadí","Pořadí v kategorii","Kategorie","Startovní číslo","Příjmení","Jméno","Narození","Oddíl / Bydliště","Čas"]
[1,1,{"$f":"'Startovní listina'!G47","v":"B"},{"$f":"'Startovní listina'!B47","v":54},{"$f":"'Startovní listina'!C47","v":"Hýbl"},{"$f":"'Startovní listina'!D47","v":"Jiří"},{"$f":"'Startovní listina'!E47","v":1967},{"$f":"'Startovní listina'!F47","v":"Hrušovany u Brna"},"02:19:48"]
[{"$f":"IF('Výsledková listina (2)'!D5<>\"\",A5+1,\"\")","v":2},null,{"$f":"'Startovní listina'!G71","v":"B"},{"$f":"'Startovní listina'!B71","v":87},{"$f":"'Startovní listina'!C71","v":"Hančl"},{"$f":"'Startovní listina'!D71","v":"Roman"},{"$f":"'Startovní listina'!E71","v":1967},{"$f":"'Startovní listina'!F71","v":"Tišnov"},"02:47:00"]
[{"$f":"IF('Výsledková listina (2)'!D6<>\"\",A6+1,\"\")","v":3},null,{"$f":"'Startovní listina'!G5","v":"A"},{"$f":"'Startovní listina'!B5","v":1},{"$f":"'Startovní listina'!C5","v":"Kratochvíl"},{"$f":"'Startovní listina'!D5","v":"Jaroslav"},{"$f":"'Startovní listina'!E5","v":1977},{"$f":"'Startovní listina'!F5","v":"SDH Hluboké"},"03:02:17"]
[{"$f":"IF('Výsledková listina (2)'!D7<>\"\",A7+1,\"\")","v":4},null,{"$f":"'Startovní listina'!G85","v":""},{"$f":"'Startovní listina'!B85","v":""},{"$f":"'Startovní listina'!C85","v":""},{"$f":"'Startovní listina'!D85","v":""},{"$f":"'Startovní listina'!E85","v":""},{"$f":"'Startovní listina'!F85","v":""},"03:28:11"]
{"$rows_left_out":95}