{"text_format":"1","workbook":"xlsx","n_sheets":12,"sheets":["Prezenční listina","Startovní listina","Výsledková listina","Výsledková listinadle kategorií","Družstva","Běh Vírem","mezičasy 2017","mezičasy 2018","Diplom MSM A5","Diplom MSM A5 (2)","Družstva (prac.)","Výsledková listina (2)"],"not_rendered":{"charts":0,"images":19,"macros":1,"external_links":0,"defined_names":15,"comments":0,"pivot_tables":0},"unopened":[],"bounds":{"document_bytes":16777216,"sheet_cells":100000,"rows_first":2000,"rows_last":500,"rows_between":2000,"halvings":0,"cell_chars":16384,"cell_head_chars":4096},"cells_cut":0,"cells_raw":0,"read":"whole","date_system":"1900"}

{"sheet":"Prezenční listina","index":0,"n_rows":152,"n_cols":19,"rows_kept":152,"cut":false,"hidden":true,"merged":[[5,10,5,12],[0,0,0,7]]}
[{"$f":"\"Prezenční listina - Malý svratecký maraton \"&O2","v":"Prezenční listina - Malý svratecký maraton 2018"}]
["#","Příjmení","Jméno","Narození","Oddíl / Bydliště","Startovní číslo","E-mail","Kategorie","Datum on-line registrace","Město",null,null,null,null,2018,null,null,null,"Pohlaví"]
[1,"Faja","Ondřej",1976,"Brno",22,"ondra.faja@seznam.cz",{"$f":"IF(S3<>\"Ž\",IF($O$2-D3>39,IF($O$2-D3>49,IF($O$2-D3>59,IF($O$2-D3>69,IF($O$2-D3>90,\"\",\"E\"),\"D\"),\"C\"),\"B\"),\"A\"),IF(S3=\"Ž\",IF($O$2-D3>34,IF($O$2-D3>44,IF($O$2-D3>90,\"\",\"H\"),\"G\"),\"F\")))","v":"B"},"2018-08-13","Brno",null,null,null,null,null,null,null,null,{"$f":"IF(LEN(B3)=0,\" \",IF(MID(B3,LEN(B3),1)=\"á\",\"Ž\",\"M\"))","v":"M"}]
[{"$f":"IF(B4<>0,A3+1,\"\")","v":2},"Fanfrdla","Dalimil",1973,"Matyteam Brno",27,"dalimil.salvator@centrum.cz","B","2018-08-18","Brno",null,null,null,null,null,null,null,null,"M"]
[3,"Glier","Michal",1982,"SDH Doubravník",49,"Michalglier@seznam.cz","A","2018-08-06","Doubravník",null,null,null,null,null,null,null,null,"M"]
[4,"Glierová","Renata",1985,"SDH Doubravník",48,"renataglierova@seznam.cz","F","2018-08-17","Doubravník","Rok nastavit v buňce O2",null,null,null,null,null,null,null,"Ž"]
[5,"Hakl","Zdeněk ",1982,"SK Tri Cyklochlubna Žďár nad Sázavou",null,"haklzdenek@seznam.cz","A","2018-08-18","Žďár nad Sázavou ",null,null,null,null,null,null,null,null,"M"]
[6,"Hanák","Jakub",1986,"Plant Powered Runners",null,"jacobakiro@gmail.com","A","2018-05-27","Vír",null,null,null,null,null,null,null,null,"M"]
{"$rows_left_out":145}
{"sheet":"Startovní listina","index":1,"n_rows":141,"n_cols":12,"rows_kept":141,"cut":false,"hidden":false,"merged":[[4,11,11,11],[0,0,0,6],[2,0,2,6],[1,0,1,6],[1,8,2,9]]}
[{"$f":"\"Startovní listina - Malý svratecký maraton \"&'Prezenční listina'!O2","v":"Startovní listina - Malý svratecký maraton 2018"}]
["2018-08-25",null,null,null,null,null,null,null,"Počet přihlášených v jednotlivých kategoriích"]
[{"$f":"'Prezenční listina'!O2-1953&\". ročník\"","v":"65. ročník"},null,null,null,null,null,null,null,null,null,null,"Celkem startujících"]
["#","Startovní číslo","Příjmení","Jméno","Narození","Oddíl / Bydliště","Kategorie"]
[1,{"$f":"IF('Prezenční listina'!F15=0,\"\",'Prezenční listina'!F15)","v":1},{"$f":"IF('Prezenční listina'!F15=0,\"\",'Prezenční listina'!B15)","v":"Komárková"},{"$f":"IF('Prezenční listina'!F15=0,\"\",'Prezenční listina'!C15)","v":"Zdeňka"},{"$f":"IF('Prezenční listina'!F15=0,\"\",'Prezenční listina'!D15)","v":1974},{"$f":"IF('Prezenční listina'!F15=0,\"\",'Prezenční listina'!E15)","v":"SDH Bolešín"},{"$f":"IF('Prezenční listina'!F15=0,\"\",'Prezenční listina'!H15)","v":"G"},null,"A:",{"$f":"COUNTIF($G$5:$G$141,\"A\")","v":19},null,{"$f":"COUNT(B5:B141)","v":67}]
[{"$f":"IF(C6=\"\",\"\",A5+1)","v":2},{"$f":"IF('Prezenční listina'!F34=0,\"\",'Prezenční listina'!F34)","v":2},{"$f":"IF('Prezenční listina'!F34=0,\"\",'Prezenční listina'!B34)","v":"Ptáček"},{"$f":"IF('Prezenční listina'!F34=0,\"\",'Prezenční listina'!C34)","v":"Michal "},{"$f":"IF('Prezenční listina'!F34=0,\"\",'Prezenční listina'!D34)","v":1986},{"$f":"IF('Prezenční listina'!F34=0,\"\",'Prezenční listina'!E34)","v":" Hrdá Ves "},{"$f":"IF('Prezenční listina'!F34=0,\"\",'Prezenční listina'!H34)","v":"A"},null,"B:",{"$f":"COUNTIF($G$5:$G$141,\"B\")","v":19}]
[3,{"$f":"IF('Prezenční listina'!F28=0,\"\",'Prezenční listina'!F28)","v":3},{"$f":"IF('Prezenční listina'!F28=0,\"\",'Prezenční listina'!B28)","v":"Mlčáková"},{"$f":"IF('Prezenční listina'!F28=0,\"\",'Prezenční listina'!C28)","v":"Hana"},{"$f":"IF('Prezenční listina'!F28=0,\"\",'Prezenční listina'!D28)","v":1981},{"$f":"IF('Prezenční listina'!F28=0,\"\",'Prezenční listina'!E28)","v":"Strážnice"},{"$f":"IF('Prezenční listina'!F28=0,\"\",'Prezenční listina'!H28)","v":"G"},null,"C:",{"$f":"COUNTIF($G$5:$G$141,\"C\")","v":8}]
[4,{"$f":"IF('Prezenční listina'!F13=0,\"\",'Prezenční listina'!F13)","v":4},{"$f":"IF('Prezenční listina'!F13=0,\"\",'Prezenční listina'!B13)","v":"Kalich"},{"$f":"IF('Prezenční listina'!F13=0,\"\",'Prezenční listina'!C13)","v":"Radim"},{"$f":"IF('Prezenční listina'!F13=0,\"\",'Prezenční listina'!D13)","v":1985},{"$f":"IF('Prezenční listina'!F13=0,\"\",'Prezenční listina'!E13)","v":"Odranec"},{"$f":"IF('Prezenční listina'!F13=0,\"\",'Prezenční listina'!H13)","v":"A"},null,"D:",{"$f":"COUNTIF($G$5:$G$141,\"D\")","v":4}]
{"$rows_left_out":134}
{"sheet":"Výsledková listina","index":2,"n_rows":104,"n_cols":11,"rows_kept":104,"cut":false,"hidden":false,"merged":[[0,0,0,8],[2,0,2,8],[1,0,1,8],[1,10,12,14]]}
[{"$f":"\"Výsledková listina - Malý svratecký maraton \"&'Prezenční listina'!O2","v":"Výsledková listina - Malý svratecký maraton 2018"}]
["2018-08-25",null,null,null,null,null,null,null,null,null,"\nPoté, co jsou dopsány časy VŠECH běžců, stisknout tlačítko 1.řazení \n\n\nVe sloupci B (Pořadí v kategorii) vytvořit posloupnou číselnou řadu pro každou kategorii a poté stisknout tlačítko 2.řazení\n\n\n                      !!! POZOR!!!\n\n               Použití tlačítek je nevratný krok!"]
[{"$f":"'Prezenční listina'!O2-1953&\". ročník\"","v":"65. ročník"}]
["Celkové pořadí","Pořadí v kategorii","Kategorie","Startovní číslo","Příjmení","Jméno","Narození","Oddíl / Bydliště","Čas"]
[1,1,{"$f":"'Startovní listina'!G49","v":"A"},{"$f":"'Startovní listina'!B49","v":45},{"$f":"'Startovní listina'!C49","v":"Kohut"},{"$f":"'Startovní listina'!D49","v":"Jan"},{"$f":"'Startovní listina'!E49","v":1985},{"$f":"'Startovní listina'!F49","v":"Univerzita Brno"},"02:02:02"]
[{"$f":"IF('Výsledková listina'!D5<>\"\",A5+1,\"\")","v":2},2,{"$f":"'Startovní listina'!G66","v":"A"},{"$f":"'Startovní listina'!B66","v":62},{"$f":"'Startovní listina'!C66","v":"Exner"},{"$f":"'Startovní listina'!D66","v":"Jakub"},{"$f":"'Startovní listina'!E66","v":1983},{"$f":"'Startovní listina'!F66","v":"P-Team"},"02:02:03"]
[{"$f":"IF('Výsledková listina'!D6<>\"\",A6+1,\"\")","v":3},1,{"$f":"'Startovní listina'!G67","v":"B"},{"$f":"'Startovní listina'!B67","v":63},{"$f":"'Startovní listina'!C67","v":"Orálek"},{"$f":"'Startovní listina'!D67","v":"Daniel"},{"$f":"'Startovní listina'!E67","v":1970},{"$f":"'Startovní listina'!F67","v":"behejbrno.com"},"02:04:27"]
[{"$f":"IF('Výsledková listina'!D7<>\"\",A7+1,\"\")","v":4},3,{"$f":"'Startovní listina'!G40","v":"A"},{"$f":"'Startovní listina'!B40","v":36},{"$f":"'Startovní listina'!C40","v":"Nováček"},{"$f":"'Startovní listina'!D40","v":"Tomáš"},{"$f":"'Startovní listina'!E40","v":1983},{"$f":"'Startovní listina'!F40","v":"SDH Kamenná"},"02:06:25"]
{"$rows_left_out":97}
{"sheet":"Výsledková listinadle kategorií","index":3,"n_rows":104,"n_cols":11,"rows_kept":104,"cut":false,"hidden":false,"merged":[[0,0,0,8],[1,0,1,8],[1,10,12,14],[2,0,2,8]]}
[{"$f":"\"Výsledková listina - Malý svratecký maraton \"&'Prezenční listina'!O2","v":"Výsledková listina - Malý svratecký maraton 2018"}]
["2018-08-25",null,null,null,null,null,null,null,null,null,"\nPoté, co jsou dopsány časy VŠECH běžců, stisknout tlačítko 1.řazení \n\n\nVe sloupci B (Pořadí v kategorii) vytvořit posloupnou číselnou řadu pro každou kategorii a poté stisknout tlačítko 2.řazení\n\n\n                      !!! POZOR!!!\n\n               Použití tlačítek je nevratný krok!"]
[{"$f":"'Prezenční listina'!O2-1953&\". ročník\"","v":"65. ročník"}]
["Celkové pořadí","Pořadí v kategorii","Kategorie","Startovní číslo","Příjmení","Jméno","Narození","Oddíl / Bydliště","Čas"]
[1,1,{"$f":"'Startovní listina'!G49","v":"A"},{"$f":"'Startovní listina'!B49","v":45},{"$f":"'Startovní listina'!C49","v":"Kohut"},{"$f":"'Startovní listina'!D49","v":"Jan"},{"$f":"'Startovní listina'!E49","v":1985},{"$f":"'Startovní listina'!F49","v":"Univerzita Brno"},"02:02:02"]
[{"$f":"IF('Výsledková listinadle kategorií'!D5<>\"\",A5+1,\"\")","v":2},2,{"$f":"'Startovní listina'!G66","v":"A"},{"$f":"'Startovní listina'!B66","v":62},{"$f":"'Startovní listina'!C66","v":"Exner"},{"$f":"'Startovní listina'!D66","v":"Jakub"},{"$f":"'Startovní listina'!E66","v":1983},{"$f":"'Startovní listina'!F66","v":"P-Team"},"02:02:03"]
[{"$f":"IF('Výsledková listinadle kategorií'!D7<>\"\",A6+1,\"\")","v":3},3,{"$f":"'Startovní listina'!G40","v":"A"},{"$f":"'Startovní listina'!B40","v":36},{"$f":"'Startovní listina'!C40","v":"Nováček"},{"$f":"'Startovní listina'!D40","v":"Tomáš"},{"$f":"'Startovní listina'!E40","v":1983},{"$f":"'Startovní listina'!F40","v":"SDH Kamenná"},"02:06:25"]
[{"$f":"IF('Výsledková listinadle kategorií'!D10<>\"\",A7+1,\"\")","v":4},4,{"$f":"'Startovní listina'!G71","v":"A"},{"$f":"'Startovní listina'!B71","v":67},{"$f":"'Startovní listina'!C71","v":"Příhoda"},{"$f":"'Startovní listina'!D71","v":"Jan"},{"$f":"'Startovní listina'!E71","v":1983},{"$f":"'Startovní listina'!F71","v":"Ždánice"},"02:13:17"]
{"$rows_left_out":97}
{"sheet":"Družstva","index":4,"n_rows":25,"n_cols":11,"rows_kept":25,"cut":false,"hidden":false,"merged":[[17,1,18,1],[17,6,18,6],[17,8,18,8],[19,1,20,1],[19,6,20,6],[19,8,20,8],[11,6,12,6],[5,8,6,8],[7,8,8,8],[9,8,10,8],[15,1,16,1],[15,6,16,6],[15,8,16,8],[3,8,4,8],[11,8,12,8],[0,1,0,8],[1,1,1,8],[13,8,14,8],[3,1,4,1],[11,1,12,1],[5,1,6,1],[7,1,8,1],[9,1,10,1],[5,6,6,6],[13,1,14,1],[3,6,4,6],[13,6,14,6],[7,6,8,6],[9,6,10,6],[21,1,22,1],[21,6,22,6],[21,8,22,8],[23,1,24,1],[23,6,24,6],[23,8,24,8]]}
[null,{"$f":"\"Výsledková listina - Malý svratecký maraton \"&'Prezenční listina'!O2&\" - družstva\"","v":"Výsledková listina - Malý svratecký maraton 2018 - družstva"}]
[null,{"$f":"'Prezenční listina'!O2-1953&\". ročník\"","v":"65. ročník"}]
[null,"Pořadí","Startovní číslo","Příjmení","Jméno","Narození","Oddíl / Bydliště","Čas","Výsledný čas"]
[null,"1.",45,{"$f":"IF(ISERROR(VLOOKUP(C4,'Startovní listina'!$B$5:$F$141,2)),\"\",VLOOKUP(C4,'Startovní listina'!$B$5:$F$141,2))","v":"Kohut"},{"$f":"IF(ISERROR(VLOOKUP(C4,'Startovní listina'!$B$5:$F$141,3)),\"\",VLOOKUP(C4,'Startovní listina'!$B$5:$F$141,3))","v":"Jan"},{"$f":"IF(ISERROR(VLOOKUP(C4,'Startovní listina'!$B$5:$F$141,4)),\"\",VLOOKUP(C4,'Startovní listina'!$B$5:$F$141,4))","v":1985},{"$f":"IF(K4=K5,K4,\"RŮZNÉ ODDÍLY !!!\")","v":"Univerzita Brno"},"02:02:02",{"$f":"IF((H4=0),\"\",H4+H5)","v":"04:15:32"},null,{"$f":"IF(ISERROR(VLOOKUP(C4,'Startovní listina'!$B$5:$F$141,5)),\"\",VLOOKUP(C4,'Startovní listina'!$B$5:$F$141,5))","v":"Univerzita Brno"}]
[null,null,46,{"$f":"IF(ISERROR(VLOOKUP(C5,'Startovní listina'!$B$5:$F$141,2)),\"\",VLOOKUP(C5,'Startovní listina'!$B$5:$F$141,2))","v":"Dvořáček"},{"$f":"IF(ISERROR(VLOOKUP(C5,'Startovní listina'!$B$5:$F$141,3)),\"\",VLOOKUP(C5,'Startovní listina'!$B$5:$F$141,3))","v":"Jiří"},{"$f":"IF(ISERROR(VLOOKUP(C5,'Startovní listina'!$B$5:$F$141,4)),\"\",VLOOKUP(C5,'Startovní listina'!$B$5:$F$141,4))","v":1968},null,"02:13:30",null,null,{"$f":"IF(ISERROR(VLOOKUP(C5,'Startovní listina'!$B$5:$F$141,5)),\"\",VLOOKUP(C5,'Startovní listina'!$B$5:$F$141,5))","v":"Univerzita Brno"}]
[null,"2.",10,{"$f":"IF(ISERROR(VLOOKUP(C6,'Startovní listina'!$B$5:$F$141,2)),\"\",VLOOKUP(C6,'Startovní listina'!$B$5:$F$141,2))","v":"Kopečný"},{"$f":"IF(ISERROR(VLOOKUP(C6,'Startovní listina'!$B$5:$F$141,3)),\"\",VLOOKUP(C6,'Startovní listina'!$B$5:$F$141,3))","v":"Dušan"},{"$f":"IF(ISERROR(VLOOKUP(C6,'Startovní listina'!$B$5:$F$141,4)),\"\",VLOOKUP(C6,'Startovní listina'!$B$5:$F$141,4))","v":1973},{"$f":"IF(K6=K7,K6,\"RŮZNÉ ODDÍLY !!!\")","v":"Liga 100 Olomouc"},"02:21:19",{"$f":"IF((H6=0),\"\",H6+H7)","v":"04:41:00"},null,{"$f":"IF(ISERROR(VLOOKUP(C6,'Startovní listina'!$B$5:$F$141,5)),\"\",VLOOKUP(C6,'Startovní listina'!$B$5:$F$141,5))","v":"Liga 100 Olomouc"}]
[null,null,6,{"$f":"IF(ISERROR(VLOOKUP(C7,'Startovní listina'!$B$5:$F$141,2)),\"\",VLOOKUP(C7,'Startovní listina'!$B$5:$F$141,2))","v":"Šerák"},{"$f":"IF(ISERROR(VLOOKUP(C7,'Startovní listina'!$B$5:$F$141,3)),\"\",VLOOKUP(C7,'Startovní listina'!$B$5:$F$141,3))","v":"Martin"},{"$f":"IF(ISERROR(VLOOKUP(C7,'Startovní listina'!$B$5:$F$141,4)),\"\",VLOOKUP(C7,'Startovní listina'!$B$5:$F$141,4))","v":1978},null,"02:19:41",null,null,{"$f":"IF(ISERROR(VLOOKUP(C7,'Startovní listina'!$B$5:$F$141,5)),\"\",VLOOKUP(C7,'Startovní listina'!$B$5:$F$141,5))","v":"Liga 100 Olomouc"}]
[null,"3.",48,{"$f":"IF(ISERROR(VLOOKUP(C8,'Startovní listina'!$B$5:$F$141,2)),\"\",VLOOKUP(C8,'Startovní listina'!$B$5:$F$141,2))","v":"Glierová"},{"$f":"IF(ISERROR(VLOOKUP(C8,'Startovní listina'!$B$5:$F$141,3)),\"\",VLOOKUP(C8,'Startovní listina'!$B$5:$F$141,3))","v":"Renata"},{"$f":"IF(ISERROR(VLOOKUP(C8,'Startovní listina'!$B$5:$F$141,4)),\"\",VLOOKUP(C8,'Startovní listina'!$B$5:$F$141,4))","v":1985},{"$f":"IF(K8=K9,K8,\"RŮZNÉ ODDÍLY !!!\")","v":"SDH Doubravník"},"02:53:08",{"$f":"IF((H8=0),\"\",H8+H9)","v":"05:08:26"},null,{"$f":"IF(ISERROR(VLOOKUP(C8,'Startovní listina'!$B$5:$F$141,5)),\"\",VLOOKUP(C8,'Startovní listina'!$B$5:$F$141,5))","v":"SDH Doubravník"}]
{"$rows_left_out":18}
{"sheet":"Běh Vírem","index":5,"n_rows":31,"n_cols":12,"rows_kept":31,"cut":false,"hidden":false,"merged":[[0,0,0,7],[2,3,2,4],[1,3,1,4]]}
[{"$f":"\"Běh Vírem \"&'Prezenční listina'!O2","v":"Běh Vírem 2018"}]
[null,null,null,{"$f":"'Startovní listina'!$A$2","v":"2018-08-25"},{"$f":"'Startovní listina'!$A$2","v":"2018-08-25"}]
[null,null,null,{"$f":"'Prezenční listina'!$O$2-1966&\" . ročník\"","v":"52 . ročník"}]
["#","Příjmení","Jméno","Narození","Oddíl / Bydliště","Startovní číslo","Čas","Pohlaví"]
[1,"Coural","Jaroslav",2002,"Vír",149,"00:11:14",{"$f":"IF(LEN(B5)=0,\" \",IF(MID(B5,LEN(B5),1)=\"á\",\"Ž\",\"M\"))","v":"M"}]
[2,"Dobrovský","Michal",2004,"Biatlon Blansko",130,"00:12:10","M"]
[3,"Lorenčík","Kryštof",2004,"Atletika Chrudim",142,"00:12:23","M"]
[4,"Jílek","František",2004,"Velké Tresné",138,"00:12:37","M"]
{"$rows_left_out":24}
{"sheet":"mezičasy 2017","index":6,"n_rows":30,"n_cols":8,"rows_kept":30,"cut":false,"hidden":true,"merged":[[0,0,0,1],[0,2,0,3],[0,4,0,5],[0,6,0,7]]}
["5. km",null,"10. km",null,"16. km",null,"25. km"]
["číslo","čas","číslo","čas","číslo","čas","číslo","čas"]
[82,"00:17:36",82,"00:35:34",82,"00:57:57",64,"01:34:10"]
[64,"00:17:53",64,"00:35:50",64,"00:57:57",82,"01:34:40"]
[48,"00:18:54",48,"00:37:43",48,"01:00:45",48,"01:37:47"]
[19,"00:18:59",19,"00:39:11",49,"01:03:42",19,"01:44:00"]
[49,"00:19:14",49,"00:39:28",19,"01:03:56",49,"01:44:00"]
[18,"00:19:52",18,"00:39:57",8,"01:05:23",8,"01:44:10"]
{"$rows_left_out":23}
{"sheet":"mezičasy 2018","index":7,"n_rows":30,"n_cols":8,"rows_kept":30,"cut":false,"hidden":true,"merged":[[0,0,0,1],[0,2,0,3],[0,4,0,5],[0,6,0,7]]}
["5. km",null,"10. km",null,"16. km",null,"25. km"]
["číslo","čas","číslo","čas","číslo","čas","číslo","čas"]
[63,"00:18:04",63,"00:36:48",63,"00:59:44","63,45,62","01:34:34"]
["45,62,43,30,36","00:18:51","45,62,43,36","00:37:33",45.62,"00:59:59",36,"01:35:57"]
[49,"00:19:50",30,"00:37:45",36,"01:00:24",43,"01:39:38"]
[6,"00:20:39",49,"00:40:11",43,"01:01:19",null,":      :"]
["40,37,25","00:20:50",null,":      :",30,"01:01:40",null,":      :"]
[null,":      :",null,":      :",49,"01:04:54",null,":      :"]
{"$rows_left_out":23}
{"sheet":"Diplom MSM A5","index":8,"n_rows":36,"n_cols":13,"rows_kept":36,"cut":false,"hidden":true,"merged":[[26,3,28,10],[29,6,31,6],[31,3,34,3],[32,12,33,13],[35,6,36,9]]}
[]
[]
[]
[]
[]
[]
[]
[]
{"$rows_left_out":29}
{"sheet":"Diplom MSM A5 (2)","index":9,"n_rows":36,"n_cols":13,"rows_kept":36,"cut":false,"hidden":true,"merged":[[26,3,28,10],[29,6,31,6],[31,3,34,3],[32,12,33,13],[35,6,36,9]]}
[]
[]
[]
[]
[]
[]
[]
[]
{"$rows_left_out":29}
{"sheet":"Družstva (prac.)","index":10,"n_rows":21,"n_cols":11,"rows_kept":21,"cut":false,"hidden":true,"merged":[[5,1,6,1],[5,6,6,6],[5,8,6,8],[0,1,0,8],[1,1,1,8],[3,1,4,1],[3,6,4,6],[3,8,4,8],[7,1,8,1],[7,6,8,6],[7,8,8,8],[9,1,10,1],[9,6,10,6],[9,8,10,8],[11,1,12,1],[11,6,12,6],[11,8,12,8],[13,1,14,1],[13,6,14,6],[13,8,14,8],[19,1,20,1],[19,6,20,6],[19,8,20,8],[15,1,16,1],[15,6,16,6],[15,8,16,8],[17,1,18,1],[17,6,18,6],[17,8,18,8]]}
[null,{"$f":"\"Výsledková listina - Malý svratecký maratón \"&'Prezenční listina'!O2&\" - družstva\"","v":"Výsledková listina - Malý svratecký maratón 2018 - družstva"}]
[null,{"$f":"'Prezenční listina'!O2-1953&\". ročník\"","v":"65. ročník"}]
[null,"Pořadí","Startovní číslo","Příjmení","Jméno","Narození","Oddíl / Bydliště","Čas","Výsledný čas"]
[null,"1.",3,{"$f":"IF(ISERROR(VLOOKUP(C4,'Startovní listina'!$B$5:$F$141,2)),\"\",VLOOKUP(C4,'Startovní listina'!$B$5:$F$141,2))","v":"Mlčáková"},{"$f":"IF(ISERROR(VLOOKUP(C4,'Startovní listina'!$B$5:$F$141,3)),\"\",VLOOKUP(C4,'Startovní listina'!$B$5:$F$141,3))","v":"Hana"},{"$f":"IF(ISERROR(VLOOKUP(C4,'Startovní listina'!$B$5:$F$141,4)),\"\",VLOOKUP(C4,'Startovní listina'!$B$5:$F$141,4))","v":1981},{"$f":"IF(K4=K5,K4,\"RŮZNÉ ODDÍLY !!!\")","v":"RŮZNÉ ODDÍLY !!!"},"03:07:50",{"$f":"IF((H4=0),\"\",H4+H5)","v":"05:48:15"},null,{"$f":"IF(ISERROR(VLOOKUP(C4,'Startovní listina'!$B$5:$F$141,5)),\"\",VLOOKUP(C4,'Startovní listina'!$B$5:$F$141,5))","v":"Strážnice"}]
[null,null,2,{"$f":"IF(ISERROR(VLOOKUP(C5,'Startovní listina'!$B$5:$F$141,2)),\"\",VLOOKUP(C5,'Startovní listina'!$B$5:$F$141,2))","v":"Ptáček"},{"$f":"IF(ISERROR(VLOOKUP(C5,'Startovní listina'!$B$5:$F$141,3)),\"\",VLOOKUP(C5,'Startovní listina'!$B$5:$F$141,3))","v":"Michal "},{"$f":"IF(ISERROR(VLOOKUP(C5,'Startovní listina'!$B$5:$F$141,4)),\"\",VLOOKUP(C5,'Startovní listina'!$B$5:$F$141,4))","v":1986},null,"02:40:25",null,null,{"$f":"IF(ISERROR(VLOOKUP(C5,'Startovní listina'!$B$5:$F$141,5)),\"\",VLOOKUP(C5,'Startovní listina'!$B$5:$F$141,5))","v":" Hrdá Ves "}]
[null,"2.",11,{"$f":"IF(ISERROR(VLOOKUP(C6,'Startovní listina'!$B$5:$F$141,2)),\"\",VLOOKUP(C6,'Startovní listina'!$B$5:$F$141,2))","v":"Holý"},{"$f":"IF(ISERROR(VLOOKUP(C6,'Startovní listina'!$B$5:$F$141,3)),\"\",VLOOKUP(C6,'Startovní listina'!$B$5:$F$141,3))","v":"Josef"},{"$f":"IF(ISERROR(VLOOKUP(C6,'Startovní listina'!$B$5:$F$141,4)),\"\",VLOOKUP(C6,'Startovní listina'!$B$5:$F$141,4))","v":1941},{"$f":"IF(K6=K7,K6,\"RŮZNÉ ODDÍLY !!!\")","v":"RŮZNÉ ODDÍLY !!!"},"02:01:16",{"$f":"IF((H6=0),\"\",H6+H7)","v":"04:06:56"},null,{"$f":"IF(ISERROR(VLOOKUP(C6,'Startovní listina'!$B$5:$F$141,5)),\"\",VLOOKUP(C6,'Startovní listina'!$B$5:$F$141,5))","v":"AC Moravská Slavia Brno"}]
[null,null,8,{"$f":"IF(ISERROR(VLOOKUP(C7,'Startovní listina'!$B$5:$F$141,2)),\"\",VLOOKUP(C7,'Startovní listina'!$B$5:$F$141,2))","v":"Pichová"},{"$f":"IF(ISERROR(VLOOKUP(C7,'Startovní listina'!$B$5:$F$141,3)),\"\",VLOOKUP(C7,'Startovní listina'!$B$5:$F$141,3))","v":"Dagmar"},{"$f":"IF(ISERROR(VLOOKUP(C7,'Startovní listina'!$B$5:$F$141,4)),\"\",VLOOKUP(C7,'Startovní listina'!$B$5:$F$141,4))","v":1977},null,"02:05:40",null,null,{"$f":"IF(ISERROR(VLOOKUP(C7,'Startovní listina'!$B$5:$F$141,5)),\"\",VLOOKUP(C7,'Startovní listina'!$B$5:$F$141,5))","v":"Brno"}]
[null,"3.",9,{"$f":"IF(ISERROR(VLOOKUP(C8,'Startovní listina'!$B$5:$F$141,2)),\"\",VLOOKUP(C8,'Startovní listina'!$B$5:$F$141,2))","v":"Tesařová"},{"$f":"IF(ISERROR(VLOOKUP(C8,'Startovní listina'!$B$5:$F$141,3)),\"\",VLOOKUP(C8,'Startovní listina'!$B$5:$F$141,3))","v":"Marie"},{"$f":"IF(ISERROR(VLOOKUP(C8,'Startovní listina'!$B$5:$F$141,4)),\"\",VLOOKUP(C8,'Startovní listina'!$B$5:$F$141,4))","v":1954},{"$f":"IF(K8=K9,K8,\"RŮZNÉ ODDÍLY !!!\")","v":"RŮZNÉ ODDÍLY !!!"},"02:40:16",{"$f":"IF((H8=0),\"\",H8+H9)","v":"05:12:53"},null,{"$f":"IF(ISERROR(VLOOKUP(C8,'Startovní listina'!$B$5:$F$141,5)),\"\",VLOOKUP(C8,'Startovní listina'!$B$5:$F$141,5))","v":"Křižanov"}]
{"$rows_left_out":14}
{"sheet":"Výsledková listina (2)","index":11,"n_rows":103,"n_cols":11,"rows_kept":103,"cut":false,"hidden":true,"merged":[[0,0,0,8],[1,0,1,8],[1,10,12,14],[2,0,2,8]]}
[{"$f":"\"Výsledková listina - Malý svratecký maraton \"&'Prezenční listina'!O2","v":"Výsledková listina - Malý svratecký maraton 2018"}]
["2015-08-22",null,null,null,null,null,null,null,null,null,"\nPoté, co jsou dopsány časy VŠECH běžců, stisknout tlačítko 1.řazení \n\n\nVe sloupci B (Pořadí v kategorii) vytvořit posloupnou číselnou řadu pro každou kategorii a poté stisknout tlačítko 2.řazení\n\n\n                      !!! POZOR!!!\n\n               Použití tlačítek je nevratný krok!"]
[{"$f":"'Prezenční listina'!O2-1953&\". ročník\"","v":"65. ročník"}]
["Celkové pořadí","Pořadí v kategorii","Kategorie","Startovní číslo","Příjmení","Jméno","Narození","Oddíl / Bydliště","Čas"]
[1,1,{"$f":"'Startovní listina'!G47","v":"B"},{"$f":"'Startovní listina'!B47","v":43},{"$f":"'Startovní listina'!C47","v":"Kocur"},{"$f":"'Startovní listina'!D47","v":"Lukáš"},{"$f":"'Startovní listina'!E47","v":1977},{"$f":"'Startovní listina'!F47","v":"Orel Šitbořice"},"02:19:48"]
[{"$f":"IF('Výsledková listina (2)'!D5<>\"\",A5+1,\"\")","v":2},null,{"$f":"'Startovní listina'!G71","v":"A"},{"$f":"'Startovní listina'!B71","v":67},{"$f":"'Startovní listina'!C71","v":"Příhoda"},{"$f":"'Startovní listina'!D71","v":"Jan"},{"$f":"'Startovní listina'!E71","v":1983},{"$f":"'Startovní listina'!F71","v":"Ždánice"},"02:47:00"]
[{"$f":"IF('Výsledková listina (2)'!D6<>\"\",A6+1,\"\")","v":3},null,{"$f":"'Startovní listina'!G5","v":"G"},{"$f":"'Startovní listina'!B5","v":1},{"$f":"'Startovní listina'!C5","v":"Komárková"},{"$f":"'Startovní listina'!D5","v":"Zdeňka"},{"$f":"'Startovní listina'!E5","v":1974},{"$f":"'Startovní listina'!F5","v":"SDH Bolešín"},"03:02:17"]
[{"$f":"IF('Výsledková listina (2)'!D7<>\"\",A7+1,\"\")","v":4},null,{"$f":"'Startovní listina'!G85","v":""},{"$f":"'Startovní listina'!B85","v":""},{"$f":"'Startovní listina'!C85","v":""},{"$f":"'Startovní listina'!D85","v":""},{"$f":"'Startovní listina'!E85","v":""},{"$f":"'Startovní listina'!F85","v":""},"03:28:11"]
{"$rows_left_out":95}